BDBM50277406 CHEMBL473287::N-(3-bromophenyl)-4-(pyridin-4-ylmethylamino)isothiazole-3-carboxamide
SMILES Brc1cccc(NC(=O)c2nscc2NCc2ccncc2)c1
InChI Key InChIKey=UWSYIJITQUJEEK-UHFFFAOYSA-N
Data  3 IC50
  Tab Delimited (TSV)   2D SDfile   Computed 3D by Vconf -m prep SDfile
Find this compound or compounds like it in BindingDB:
Activity Spreadsheet -- Enzyme Inhibition Constant Data from BindingDB
Found 3 hits for monomerid = 50277406
TargetVascular endothelial growth factor receptor 1(Homo sapiens (Human))
Decode
Curated by ChEMBL
LigandPNGBDBM50277406(CHEMBL473287 | N-(3-bromophenyl)-4-(pyridin-4-ylme...)
Affinity DataIC50:  55nM. Assay description: Inhibition of VEGFR1 (unknown origin) assessed as blockade of pGAT-biotin phosphorylation in presence of 2 uM ATP by HTRF assay
In DepthDetails ArticlePubMed
TargetVascular endothelial growth factor receptor 2(Homo sapiens (Human))
Decode
Curated by ChEMBL
LigandPNGBDBM50277406(CHEMBL473287 | N-(3-bromophenyl)-4-(pyridin-4-ylme...)
Affinity DataIC50:  27nM. Assay description: Inhibition of VEGFR2 (unknown origin) assessed as blockade of pGAT-biotin phosphorylation in presence of 2 uM ATP by HTRF assay
In DepthDetails ArticlePubMed
TargetVascular endothelial growth factor receptor 2(Homo sapiens (Human))
Decode
Curated by ChEMBL
LigandPNGBDBM50277406(CHEMBL473287 | N-(3-bromophenyl)-4-(pyridin-4-ylme...)
Affinity DataIC50:  210nM. Assay description: Inhibition of VEGFR2 (unknown origin) expressed in HEK293 cells assessed as inhibition of receptor phosphorylation by ELISA
In DepthDetails ArticlePubMed