BDBM50277824 4'-Amino-4-fluoro-2'',4''-dimethoxy-6'-methylsulfanyl-[1,1';2',1'']terphenyl-3',5'-dicarbonitrile::CHEMBL521291
SMILES COc1ccc(c(OC)c1)-c1c(C#N)c(N)c(C#N)c(SC)c1-c1ccc(F)cc1
InChI Key InChIKey=GKUSWJBFDJZBGE-UHFFFAOYSA-N
Data  1 IC50
  Tab Delimited (TSV)   2D SDfile   Computed 3D by Vconf -m prep SDfile
Find this compound or compounds like it in BindingDB:
Activity Spreadsheet -- Enzyme Inhibition Constant Data from BindingDB
Found 1 hit for monomerid = 50277824
TargetGlucose-6-phosphatase catalytic subunit 1(Homo sapiens (Human))
Central Drug Research Institute
Curated by ChEMBL
LigandPNGBDBM50277824(4'-Amino-4-fluoro-2'',4''-dimethoxy-6'-methylsulfa...)
Affinity DataIC50:  7.90E+4nM. Assay description: Inhibition of glucose-6-phosphatase (unknown origin)
In DepthDetails ArticlePubMed