BDBM50281806 (S)-2-{(2S,3S)-2-[(S)-2-{N'-[2-((S)-1-{(S)-2-[(Adamantane-1-carbonyl)-amino]-6-amino-hexanoyl}-pyrrolidin-2-yl)-2-oxo-ethyl]-hydrazino}-3-(4-hydroxy-phenyl)-propionylamino]-3-methyl-pentanoylamino}-4-methyl-pentanoic acid::CHEMBL275752
SMILES CC[C@H](C)[C@H](NC(=O)[C@H](Cc1ccc(O)cc1)NNCC(=O)[C@@H]1CCCN1C(=O)[C@H](CCCCN)NC(=O)C12C[C@H]3C[C@H](C[C@H](C3)C1)C2)C(=O)N[C@@H](CC(C)C)C(O)=O
InChI Key InChIKey=RRJKDPKIORLJNC-BXFSUTSLSA-N
Data  1 KI
  Tab Delimited (TSV)   2D SDfile   Computed 3D by Vconf -m prep SDfile
Find this compound or compounds like it in BindingDB:
Activity Spreadsheet -- Enzyme Inhibition Constant Data from BindingDB
Found 1 hit for monomerid = 50281806
TargetNeurotensin receptor type 1(Rattus norvegicus)
TBA
Curated by ChEMBL
LigandPNGBDBM50281806((S)-2-{(2S,3S)-2-[(S)-2-{N'-[2-((S)-1-{(S)-2-[(Ada...)
Affinity DataKi:  1.61E+3nM. Assay description: Neurotensin receptor binding affinity by displacement of [3H]- neurotensin
In DepthDetails Article