BDBM50282205 CHEMBL4171710
SMILES COc1cc2nc(nc(N)c2cc1OC)N1CCC[C@H](C1)NC(=O)c1ccco1
InChI Key InChIKey=KUSUAKLXHXASTN-GFCCVEGCSA-N
Data  3 KI
  Tab Delimited (TSV)   2D SDfile   Computed 3D by Vconf -m prep SDfile
Find this compound or compounds like it in BindingDB:
Activity Spreadsheet -- Enzyme Inhibition Constant Data from BindingDB
Found 3 hits for monomerid = 50282205
TargetAlpha-1D adrenergic receptor(Homo sapiens (Human))
Alma Mater Studiorum-University Of Bologna
Curated by ChEMBL
LigandPNGBDBM50282205(CHEMBL4171710)
Affinity DataKi:  37nM. Assay description: Displacement of [3H]prazosin from human alpha1D adrenoceptor expressed in CHO cell membranes after 30 mins
In DepthDetails ArticlePubMed
TargetAlpha-1B adrenergic receptor(Homo sapiens (Human))
Alma Mater Studiorum-University Of Bologna
Curated by ChEMBL
LigandPNGBDBM50282205(CHEMBL4171710)
Affinity DataKi:  43nM. Assay description: Displacement of [3H]prazosin from human alpha1B adrenoceptor expressed in CHO cell membranes after 30 mins
In DepthDetails ArticlePubMed
TargetAlpha-1A adrenergic receptor(Homo sapiens (Human))
Alma Mater Studiorum-University Of Bologna
Curated by ChEMBL
LigandPNGBDBM50282205(CHEMBL4171710)
Affinity DataKi:  110nM. Assay description: Displacement of [3H]prazosin from human alpha1A adrenoceptor expressed in CHO cell membranes after 30 mins
In DepthDetails ArticlePubMed