BDBM50286883 1-[1-(3,3-Dimethyl-2-oxo-pentyl)-2-oxo-5-phenyl-2,3-dihydro-1H-benzo[e][1,4]diazepin-3-yl]-3-m-tolyl-urea::CHEMBL356191
SMILES CCC(C)(C)C(=O)CN1c2ccccc2C(=NC(NC(=O)Nc2cccc(C)c2)C1=O)c1ccccc1
InChI Key InChIKey=GGLPHJZLYBQRAC-UHFFFAOYSA-N
Data  2 IC50
  Tab Delimited (TSV)   2D SDfile   Computed 3D by Vconf -m prep SDfile
Find this compound or compounds like it in BindingDB:
Activity Spreadsheet -- Enzyme Inhibition Constant Data from BindingDB
Found 2 hits for monomerid = 50286883
LigandPNGBDBM50286883(1-[1-(3,3-Dimethyl-2-oxo-pentyl)-2-oxo-5-phenyl-2,...)
Affinity DataIC50:  0.570nM. Assay description: Ability to displace [125I]-CCK-8 from gastrin/Cholecystokinin type B receptor from rat brain
In DepthDetails Article
TargetCholecystokinin receptor type A(Homo sapiens (Human))
TBA
Curated by ChEMBL
LigandPNGBDBM50286883(1-[1-(3,3-Dimethyl-2-oxo-pentyl)-2-oxo-5-phenyl-2,...)
Affinity DataIC50:  720nM. Assay description: Compound was evaluated for its ability to displace [3H]-L-364,718 from Cholecystokinin type A receptor from rat pancreas
In DepthDetails Article