BDBM50287127 (S)-2-(5-Hydroxy-4-oxo-4H-pyran-2-ylmethoxycarbonylamino)-3-phenyl-propionic acid 5-hydroxy-4-oxo-4H-pyran-2-ylmethyl ester::CHEMBL24152
SMILES Oc1coc(COC(=O)N[C@@H](Cc2ccccc2)C(=O)OCc2cc(=O)c(O)co2)cc1=O
InChI Key InChIKey=FRHWKFZWBASRKV-INIZCTEOSA-N
Data  1 IC50
  Tab Delimited (TSV)   2D SDfile   Computed 3D by Vconf -m prep SDfile
Find this compound or compounds like it in BindingDB:
Activity Spreadsheet -- Enzyme Inhibition Constant Data from BindingDB
Found 1 hit for monomerid = 50287127
TargetTyrosinase(Homo sapiens (Human))
TBA
Curated by ChEMBL
LigandPNGBDBM50287127((S)-2-(5-Hydroxy-4-oxo-4H-pyran-2-ylmethoxycarbony...)
Affinity DataIC50:  60nM. Assay description: Compound was evaluated for inhibition of tyrosinase enzyme.
In DepthDetails Article