BDBM50288845 CHEMBL4172307
SMILES CC[C@H](C)[C@H](N)C(=O)N[C@@H](CCC(O)=O)C(=O)N[C@@H]([C@@H](C)O)C(=O)NC(CC(O)=O)C=O
InChI Key InChIKey=GMZOIRBEINPKMU-UHFFFAOYSA-N
Data  1 IC50
  Tab Delimited (TSV)   2D SDfile   Computed 3D by Vconf -m prep SDfile
Find this compound or compounds like it in BindingDB:
Activity Spreadsheet -- Enzyme Inhibition Constant Data from BindingDB
Found 1 hit for monomerid = 50288845
TargetCaspase-14(Homo sapiens (Human))
University Of Florida
Curated by ChEMBL
LigandPNGBDBM50288845(CHEMBL4172307)
Affinity DataIC50:  7.28E+3nM. Assay description: Inhibition of human caspase 14 using Ac-WEHD-AMC fluorogenic peptide as substrate by fluorescence assay
In DepthDetails ArticlePubMed