BDBM50289653 ENDOTHELIN::ET-1::Endothelin 1::Et 1
SMILES [H][C@]12CSSC[C@@]([H])(NC(=O)[C@H](CCC(O)=O)NC(=O)[C@H](CCCCN)NC(=O)[C@@H](CC(O)=O)NC(=O)[C@H](CCSC)NC(=O)[C@@H](CC(C)C)NC(=O)[C@H](CO)NC(=O)[C@@H](CO)NC1=O)C(=O)N[C@@H](C(C)C)C(=O)N[C@H](Cc1ccc(O)cc1)C(=O)N[C@@H](Cc1ccccc1)C(=O)N[C@@H](CSSC[C@@H](N)C(=O)N[C@H](CO)C(=O)N2)C(=O)N[C@@H](Cc1c[nH]cn1)C(=O)N[C@@H](CC(C)C)C(=O)N[C@@H](CC(O)=O)C(=O)N[C@@H]([C@@H](C)CC)C(=O)N[C@@H]([C@@H](C)CC)C(=O)N[C@@H](Cc1c[nH]c2ccccc12)C(O)=O
InChI Key InChIKey=ZUBDGKVDJUIMQQ-UBFCDGJISA-N
Data  1 IC50
  Tab Delimited (TSV)   2D SDfile   Computed 3D by Vconf -m prep SDfile
Find this compound or compounds like it in BindingDB:
Activity Spreadsheet -- Enzyme Inhibition Constant Data from BindingDB
Found 1 hit for monomerid = 50289653
TargetEndothelin receptor type B(Bos taurus)
TBA
Curated by ChEMBL
LigandPNGBDBM50289653(ENDOTHELIN | ET-1 | Endothelin 1 | Et 1)
Affinity DataIC50:  1.00E+3nM. Assay description: Binding activity to ET-B receptor on bovine cerebellum membrane
In DepthDetails Article