BDBM50292489 ((2R,3S,4R,5R)-5-(6-amino-9H-purin-9-yl)-3,4-dihydroxytetrahydrofuran-2-yl)methyl 4-(N-(3-phenylpropyl)sulfamoyl)benzoate::CHEMBL519230
SMILES Nc1ncnc2n(cnc12)[C@@H]1O[C@H](COC(=O)c2ccc(cc2)S(=O)(=O)NCCCc2ccccc2)[C@@H](O)[C@H]1O
InChI Key InChIKey=HKKNAWHSWGQGFV-PTGPVQHPSA-N
Data  2 IC50
  Tab Delimited (TSV)   2D SDfile   Computed 3D by Vconf -m prep SDfile
Find this compound or compounds like it in BindingDB:
Activity Spreadsheet -- Enzyme Inhibition Constant Data from BindingDB
Found 2 hits for monomerid = 50292489
TargetTyrosine-protein kinase transforming protein Abl(Abelson murine leukemia virus)
Smith Kline & French Laboratories
Curated by ChEMBL
LigandPNGBDBM50292489(((2R,3S,4R,5R)-5-(6-amino-9H-purin-9-yl)-3,4-dihyd...)
Affinity DataIC50:  5.60E+4nM. Assay description: Inhibition of p60-vabl tyrosine kinase isolated from Abelson murine leukemia virus (A-MuLV)
In DepthDetails ArticlePubMed
TargetTyrosine-protein kinase transforming protein Abl(Abelson murine leukemia virus)
Smith Kline & French Laboratories
Curated by ChEMBL
LigandPNGBDBM50292489(((2R,3S,4R,5R)-5-(6-amino-9H-purin-9-yl)-3,4-dihyd...)
Affinity DataIC50:  6.00E+4nM. Assay description: Inhibition of Abelson murine leukemia virus p60 v-abl
In DepthDetails ArticlePubMed