BDBM50294172 CHEMBL264669::N-(pyridin-3-ylmethyl)aniline::N-(pyridin-3-ylmethyl)benzenamine
SMILES C(Nc1ccccc1)c1cccnc1
InChI Key InChIKey=BJXLHKJBRORJJJ-UHFFFAOYSA-N
Data  2 IC50
PDB links: 3 PDB IDs match this monomer.
  Tab Delimited (TSV)   2D SDfile   Computed 3D by Vconf -m prep SDfile
Find this compound or compounds like it in BindingDB:
Activity Spreadsheet -- Enzyme Inhibition Constant Data from BindingDB
Found 2 hits for monomerid = 50294172
TargetLeukotriene A-4 hydrolase(Homo sapiens (Human))
Decode Biostructures
Curated by ChEMBL
LigandPNGBDBM50294172(CHEMBL264669 | N-(pyridin-3-ylmethyl)aniline | N-(...)
Affinity DataIC50:  1.32E+6nM. Assay description: Inhibition of peptidase activity of human recombinant LTA4H expressed in Escherichia coli BL21-AI/pRARE
TargetLeukotriene A-4 hydrolase(Homo sapiens (Human))
Decode Biostructures
Curated by ChEMBL
LigandPNGBDBM50294172(CHEMBL264669 | N-(pyridin-3-ylmethyl)aniline | N-(...)
Affinity DataIC50:  1.67E+6nM. Assay description: Inhibition of hydrolase activity of human recombinant LTA4H expressed in Escherichia coli BL21-AI/pRARE assessed as LTB4 formation by tandem quadrupo...