BDBM50300185 CHEMBL583915::N-[5-benzylamino-1S-(3,5-difluoro-phenoxymethyl)-2S-hydroxy-4R-methoxy-pentyl]-5-(methanesulfonyl-methyl-amino)-N'-(1R-phenyl-ethyl)-isophthalamide
SMILES CO[C@@H](CNCc1ccccc1)C[C@H](O)[C@H](COc1cc(F)cc(F)c1)NC(=O)c1cc(cc(c1)C(=O)N[C@H](C)c1ccccc1)N(C)S(C)(=O)=O
InChI Key InChIKey=RVLBBCQVPOSNBV-SLTDDSHKSA-N
Data  1 IC50
  Tab Delimited (TSV)   2D SDfile   Computed 3D by Vconf -m prep SDfile
Find this compound or compounds like it in BindingDB:
Activity Spreadsheet -- Enzyme Inhibition Constant Data from BindingDB
Found 1 hit for monomerid = 50300185
TargetBeta-secretase 1(Homo sapiens (Human))
Stockholm University
Curated by ChEMBL
LigandPNGBDBM50300185(CHEMBL583915 | N-[5-benzylamino-1S-(3,5-difluoro-p...)
Affinity DataIC50: >1.00E+4nM. Assay description: Inhibition of human brain BACE1 expressed in Escherichia coli BL21(DE) by TRF assay
In DepthDetails ArticlePubMed