BDBM50304242 6,7-Dimethoxy-2-[3-(pyrrolidin-1-ylmethyl)-phenyl]-chroman-4-one::CHEMBL593023
SMILES COc1cc2OC(CC(=O)c2cc1OC)c1cccc(c1)N1CCCC1
InChI Key InChIKey=BOGQEIFPZQGCJA-UHFFFAOYSA-N
Data  2 IC50
  Tab Delimited (TSV)   2D SDfile   Computed 3D by Vconf -m prep SDfile
Find this compound or compounds like it in BindingDB:
Activity Spreadsheet -- Enzyme Inhibition Constant Data from BindingDB
Found 2 hits for monomerid = 50304242
TargetCarboxylic ester hydrolase(Rattus norvegicus (rat))
Zhejiang University
Curated by ChEMBL
LigandPNGBDBM50304242(6,7-Dimethoxy-2-[3-(pyrrolidin-1-ylmethyl)-phenyl]...)
Affinity DataIC50: >1.00E+5nM. Assay description: Inhibition of BChE in rat serum after 15 mins by modified Ellman's method
In DepthDetails ArticlePubMed
TargetAcetylcholinesterase(Rattus norvegicus (rat))
Zhejiang University
Curated by ChEMBL
LigandPNGBDBM50304242(6,7-Dimethoxy-2-[3-(pyrrolidin-1-ylmethyl)-phenyl]...)
Affinity DataIC50:  5.36E+3nM. Assay description: Inhibition of AChE in rat cortex after 15 mins by modified Ellman's method
In DepthDetails ArticlePubMed