BDBM50305494 4-(3-(3-chloro-5-(methylsulfonyl)phenoxy)phenyl)-8-(trifluoromethyl)quinoline-3-carboxamide::CHEMBL602446
SMILES CS(=O)(=O)c1cc(Cl)cc(Oc2cccc(c2)-c2c(cnc3c(cccc23)C(F)(F)F)C(N)=O)c1
InChI Key InChIKey=OXAVBDIDWNTRGP-UHFFFAOYSA-N
Data  4 IC50  4 EC50
  Tab Delimited (TSV)   2D SDfile   Computed 3D by Vconf -m prep SDfile
Find this compound or compounds like it in BindingDB:
Activity Spreadsheet -- Enzyme Inhibition Constant Data from BindingDB
Found 8 hits for monomerid = 50305494
TargetOxysterols receptor LXR-beta(Homo sapiens (Human))
Wyeth Pharmaceuticals
Curated by ChEMBL
LigandPNGBDBM50305494(4-(3-(3-chloro-5-(methylsulfonyl)phenoxy)phenyl)-8...)
Affinity DataIC50:  62nM. Assay description: Displacement of [3H]TO901317 from human recombinant LXRbeta expressed in Escherichia coli by flashplate method
In DepthDetails ArticlePubMed
TargetOxysterols receptor LXR-beta(Homo sapiens (Human))
Wyeth Pharmaceuticals
Curated by ChEMBL
LigandPNGBDBM50305494(4-(3-(3-chloro-5-(methylsulfonyl)phenoxy)phenyl)-8...)
Affinity DataEC50:  1.09E+4nM. Assay description: Agonist activity at human LXRalpha in HEK293 cells assessed as Gal4 transactivation
In DepthDetails ArticlePubMed
TargetOxysterols receptor LXR-beta(Homo sapiens (Human))
Wyeth Pharmaceuticals
Curated by ChEMBL
LigandPNGBDBM50305494(4-(3-(3-chloro-5-(methylsulfonyl)phenoxy)phenyl)-8...)
Affinity DataIC50:  61nM. Assay description: Displacement of [3H]T0901317 from human LXRbeta ligand binding domain
In DepthDetails ArticlePubMed
TargetOxysterols receptor LXR-alpha(Homo sapiens (Human))
Wyeth Pharmaceuticals
Curated by ChEMBL
LigandPNGBDBM50305494(4-(3-(3-chloro-5-(methylsulfonyl)phenoxy)phenyl)-8...)
Affinity DataIC50:  1.77E+3nM. Assay description: Displacement of [3H]T0901317 from human LXRalpha ligand binding domain
In DepthDetails ArticlePubMed
TargetOxysterols receptor LXR-beta(Homo sapiens (Human))
Wyeth Pharmaceuticals
Curated by ChEMBL
LigandPNGBDBM50305494(4-(3-(3-chloro-5-(methylsulfonyl)phenoxy)phenyl)-8...)
Affinity DataEC50:  1.70E+3nM. Assay description: Agonist activity at human recombinant LXRbeta ligand binding domain in human HuH7 cells cotransfected with fused Gal4-DBD by transactivation assay
In DepthDetails ArticlePubMed
TargetOxysterols receptor LXR-beta(Homo sapiens (Human))
Wyeth Pharmaceuticals
Curated by ChEMBL
LigandPNGBDBM50305494(4-(3-(3-chloro-5-(methylsulfonyl)phenoxy)phenyl)-8...)
Affinity DataEC50:  5.10E+3nM. Assay description: Agonist activity at human recombinant LXRalpha ligand binding domain in human HuH7 cells cotransfected with fused Gal4-DBD by transactivation assay
In DepthDetails ArticlePubMed
TargetOxysterols receptor LXR-alpha(Homo sapiens (Human))
Wyeth Pharmaceuticals
Curated by ChEMBL
LigandPNGBDBM50305494(4-(3-(3-chloro-5-(methylsulfonyl)phenoxy)phenyl)-8...)
Affinity DataIC50:  1.77E+3nM. Assay description: Displacement of [3H]TO901317 from human recombinant LXRalpha expressed in Escherichia coli by flashplate method
In DepthDetails ArticlePubMed
TargetOxysterols receptor LXR-beta(Homo sapiens (Human))
Wyeth Pharmaceuticals
Curated by ChEMBL
LigandPNGBDBM50305494(4-(3-(3-chloro-5-(methylsulfonyl)phenoxy)phenyl)-8...)
Affinity DataEC50:  460nM. Assay description: Agonist activity at human LXRbeta in HEK293 cells assessed as Gal4 transactivation
In DepthDetails ArticlePubMed