BDBM50307308 (R)-(4-Methoxy-phenyl)-carbamic acid 2-(2-carbamimidoyl-benzo[b]thiophen-4-yloxy)-2-phenyl-ethyl ester::CHEMBL596968
SMILES COc1ccc(NC(=O)OC[C@H](Oc2cccc3sc(cc23)C(N)=N)c2ccccc2)cc1
InChI Key InChIKey=IEKKKOCYKOJJBP-NRFANRHFSA-N
Data  3 KI
  Tab Delimited (TSV)   2D SDfile   Computed 3D by Vconf -m prep SDfile
Find this compound or compounds like it in BindingDB:
Activity Spreadsheet -- Enzyme Inhibition Constant Data from BindingDB
Found 3 hits for monomerid = 50307308
TargetCoagulation factor IX(Homo sapiens (Human))
Trigen
Curated by ChEMBL
LigandPNGBDBM50307308((R)-(4-Methoxy-phenyl)-carbamic acid 2-(2-carbamim...)
Affinity DataKi:  3nM. Assay description: Inhibition of human recombinant factor 9a by amidolytic assay
In DepthDetails ArticlePubMed
TargetUrokinase-type plasminogen activator(Homo sapiens (Human))
Trigen
Curated by ChEMBL
LigandPNGBDBM50307308((R)-(4-Methoxy-phenyl)-carbamic acid 2-(2-carbamim...)
Affinity DataKi:  89nM. Assay description: Inhibition of uPA
In DepthDetails ArticlePubMed
TargetCoagulation factor X(Homo sapiens (Human))
Trigen
Curated by ChEMBL
LigandPNGBDBM50307308((R)-(4-Methoxy-phenyl)-carbamic acid 2-(2-carbamim...)
Affinity DataKi:  600nM. Assay description: Inhibition of factor 10a by amidolytic assay
In DepthDetails ArticlePubMed