BDBM50310884 CHEMBL1078502::N,N'-(9-(cycloheptylamino)acridine-3,6-diyl)bis(3-(pyrrolidin-1-yl)propanamide)
SMILES O=C(CCN1CCCC1)Nc1ccc2c(NC3CCCCCC3)c3ccc(NC(=O)CCN4CCCC4)cc3nc2c1
InChI Key InChIKey=YMXRYBNAQKQXFU-UHFFFAOYSA-N
Data  1 IC50
  Tab Delimited (TSV)   2D SDfile   Computed 3D by Vconf -m prep SDfile
Find this compound or compounds like it in BindingDB:
Activity Spreadsheet -- Enzyme Inhibition Constant Data from BindingDB
Found 1 hit for monomerid = 50310884
TargetTelomerase reverse transcriptase(Homo sapiens (Human))
Central University Of Las Villas
Curated by ChEMBL
LigandPNGBDBM50310884(CHEMBL1078502 | N,N'-(9-(cycloheptylamino)acridine...)
Affinity DataIC50:  210nM. Assay description: Inhibition of telomerase in human A2780 cells by TRAP assay
In DepthDetails ArticlePubMed