BDBM50312812 (3aS,8aR)-3a,8-dimethyl-1-(2-phenylpropyl)-1,2,3,3a,8,8a-hexahydropyrrolo[2,3-b]indol-5-yl 4-isopropylphenylcarbamate::CHEMBL1080730
SMILES CC(C)c1ccc(NC(=O)Oc2ccc3N(C)[C@H]4N(CC(C)c5ccccc5)CC[C@@]4(C)c3c2)cc1
InChI Key InChIKey=JWDHHFCANLWIQY-FHLQUELDSA-N
Data  2 IC50
  Tab Delimited (TSV)   2D SDfile   Computed 3D by Vconf -m prep SDfile
Find this compound or compounds like it in BindingDB:
Activity Spreadsheet -- Enzyme Inhibition Constant Data from BindingDB
Found 2 hits for monomerid = 50312812
TargetAcetylcholinesterase(Mus musculus (mouse))
Kyoto University
Curated by ChEMBL
LigandPNGBDBM50312812((3aS,8aR)-3a,8-dimethyl-1-(2-phenylpropyl)-1,2,3,3...)
Affinity DataIC50: >1.00E+5nM. Assay description: Inhibition of mouse brain AChE after 1 hr by modified Ellman's colorimetric method
In DepthDetails ArticlePubMed
TargetCholinesterase(Mus musculus (Mouse))
Kyoto University
Curated by ChEMBL
LigandPNGBDBM50312812((3aS,8aR)-3a,8-dimethyl-1-(2-phenylpropyl)-1,2,3,3...)
Affinity DataIC50:  720nM. Assay description: Inhibition of mouse serum BChE after 1 hr by modified Ellman's colorimetric method
In DepthDetails ArticlePubMed