BDBM50317663 3-[3-(4-Cyano-2-methyl-3-trifluoromethylphenyl)-5,5-dimethyl-4-oxo-2-thioxoimidazolidin-1-yl]propane-1-sulfonamide::CHEMBL1099087
SMILES Cc1c(ccc(C#N)c1C(F)(F)F)N1C(=S)N(CCCS(N)(=O)=O)C(C)(C)C1=O
InChI Key InChIKey=LZPRUZAMSHSECE-UHFFFAOYSA-N
Data  2 IC50
  Tab Delimited (TSV)   2D SDfile   Computed 3D by Vconf -m prep SDfile
Find this compound or compounds like it in BindingDB:
Activity Spreadsheet -- Enzyme Inhibition Constant Data from BindingDB
Found 2 hits for monomerid = 50317663
TargetAndrogen receptor(Homo sapiens (Human))
Chugai Pharmaceutical
Curated by ChEMBL
LigandPNGBDBM50317663(3-[3-(4-Cyano-2-methyl-3-trifluoromethylphenyl)-5,...)
Affinity DataIC50:  260nM. Assay description: Displacement of [3H]mibolerone from human AR expressed in CHO-K1 cells after 2 hrs by scintillation counting
In DepthDetails ArticlePubMed
TargetAndrogen receptor(Homo sapiens (Human))
Chugai Pharmaceutical
Curated by ChEMBL
LigandPNGBDBM50317663(3-[3-(4-Cyano-2-methyl-3-trifluoromethylphenyl)-5,...)
Affinity DataIC50:  1.10E+3nM. Assay description: Antagonist activity at AR in human LNCAP cells assessed as effect on cell proliferation after 6 days
In DepthDetails ArticlePubMed