BDBM50320688 CHEMBL1164435::N'-(3-ethoxy-4-hydroxy-5-iodobenzylidene)-2-(p-tolyloxy)acetohydrazide
SMILES CCOc1cc(C=NNC(=O)COc2ccc(C)cc2)cc(I)c1O
InChI Key InChIKey=TXMJUTBKDJNPSI-UHFFFAOYSA-N
Data  1 IC50
  Tab Delimited (TSV)   2D SDfile   Computed 3D by Vconf -m prep SDfile
Find this compound or compounds like it in BindingDB:
Activity Spreadsheet -- Enzyme Inhibition Constant Data from BindingDB
Found 1 hit for monomerid = 50320688
TargetBeta-secretase 1(Homo sapiens (Human))
Applied Science University
Curated by ChEMBL
LigandPNGBDBM50320688(CHEMBL1164435 | N'-(3-ethoxy-4-hydroxy-5-iodobenzy...)
Affinity DataIC50:  1.00E+5nM. Assay description: Inhibition of BACE1 after 2 hrs by FRET assay
In DepthDetails ArticlePubMed