BDBM50322646 (2S,5S,8S,11S,14S,17S)-14-((1H-indol-3-yl)methyl)-17-amino-2-(3-guanidinopropyl)-8-isobutyl-5,11-dimethyl-4,7,10,13,16-pentaoxo-18-phenyl-3,6,9,12,15-pentaazaoctadecan-1-oic acid::CHEMBL1170635
SMILES CC(C)C[C@H](NC(=O)[C@H](C)NC(=O)[C@H](Cc1c[nH]c2ccccc12)NC(=O)[C@@H](N)Cc1ccccc1)C(=O)N[C@@H](C)C(=O)N[C@@H](CCCN=C(N)N)C(O)=O
InChI Key InChIKey=AAZGKAHUHCIIBH-CAVCRTFISA-N
Data  2 EC50
  Tab Delimited (TSV)   2D SDfile   Computed 3D by Vconf -m prep SDfile
Find this compound or compounds like it in BindingDB:
Activity Spreadsheet -- Enzyme Inhibition Constant Data from BindingDB
Found 2 hits for monomerid = 50322646
TargetC3a anaphylatoxin chemotactic receptor(Homo sapiens (Human))
The University Of Queensland
Curated by ChEMBL
LigandPNGBDBM50322646((2S,5S,8S,11S,14S,17S)-14-((1H-indol-3-yl)methyl)-...)
Affinity DataEC50:  1.20E+3nM. Assay description: Antagonist activity at human C3a receptor in human U937 cells assessed as inhibition of intracellular calcium mobilization
In DepthDetails ArticlePubMed
TargetC3a anaphylatoxin chemotactic receptor(Homo sapiens (Human))
The University Of Queensland
Curated by ChEMBL
LigandPNGBDBM50322646((2S,5S,8S,11S,14S,17S)-14-((1H-indol-3-yl)methyl)-...)
Affinity DataEC50:  1.20E+3nM. Assay description: Agonist activity at human C3a receptor in human U937 cells assessed as induction of intracellular calcium release
In DepthDetails ArticlePubMed