BDBM50323391 5-isopropyl-1,4,5,6-tetrahydrocyclopenta[c]pyrazole-3-carboxylic acid::CHEMBL1208920
SMILES CC(C)C1Cc2[nH]nc(C(O)=O)c2C1
InChI Key InChIKey=GPBFYQJKFABUGU-UHFFFAOYSA-N
Data  2 IC50
  Tab Delimited (TSV)   2D SDfile   Computed 3D by Vconf -m prep SDfile
Find this compound or compounds like it in BindingDB:
Activity Spreadsheet -- Enzyme Inhibition Constant Data from BindingDB
Found 2 hits for monomerid = 50323391
TargetHydroxycarboxylic acid receptor 2(Homo sapiens (Human))
Merck Research Laboratories
Curated by ChEMBL
LigandPNGBDBM50323391(5-isopropyl-1,4,5,6-tetrahydrocyclopenta[c]pyrazol...)
Affinity DataIC50:  1.70E+3nM. Assay description: Displacement of [3H]nicotinic acid from human GPR10a receptor
In DepthDetails ArticlePubMed
TargetHydroxycarboxylic acid receptor 2(Mus musculus)
Merck Research Laboratories
Curated by ChEMBL
LigandPNGBDBM50323391(5-isopropyl-1,4,5,6-tetrahydrocyclopenta[c]pyrazol...)
Affinity DataIC50:  990nM. Assay description: Displacement of [3H]nicotinic acid from mouse GPR10a receptor
In DepthDetails ArticlePubMed