BDBM50323872 (6S,9S,12S,15S)-1,19-diamino-9-(3-amino-3-oxopropyl)-6-(2-aminobenzamido)-12-(carboxymethyl)-1-imino-7,10,13-trioxo-2,8,11,14-tetraazanonadecane-15-carboxylic acid::CHEMBL1214093
SMILES NCCCC[C@H](NC(=O)[C@H](CC(O)=O)NC(=O)[C@H](CCC(N)=O)NC(=O)[C@H](CCCNC(N)=N)NC(=O)c1ccccc1N)C(O)=O
InChI Key InChIKey=YUUZAORGNTXPTH-MUGJNUQGSA-N
Data  2 KI
  Tab Delimited (TSV)   2D SDfile   Computed 3D by Vconf -m prep SDfile
Find this compound or compounds like it in BindingDB:
Activity Spreadsheet -- Enzyme Inhibition Constant Data from BindingDB
Found 2 hits for monomerid = 50323872
TargetTransmembrane protease serine 11D(Homo sapiens (Human))
Faculty Of Chemistry Gdansk University
Curated by ChEMBL
LigandPNGBDBM50323872((6S,9S,12S,15S)-1,19-diamino-9-(3-amino-3-oxopropy...)
Affinity DataKi:  112nM. Assay description: Inhibition of human HAT by FRET assay
In DepthDetails ArticlePubMed
TargetSuppressor of tumorigenicity 14 protein(Homo sapiens (Human))
Faculty Of Chemistry Gdansk University
Curated by ChEMBL
LigandPNGBDBM50323872((6S,9S,12S,15S)-1,19-diamino-9-(3-amino-3-oxopropy...)
Affinity DataKi:  1.71E+3nM. Assay description: Inhibition of human matriptase by FRET assay
In DepthDetails ArticlePubMed