BDBM50325132 4-chloro-N-(5-ethyl-4-(4-hydroxyphenyl)-1,3-selenazol-2-yl)benzamide::CHEMBL1222506
SMILES CCc1[se]c(NC(=O)c2ccc(Cl)cc2)nc1-c1ccc(O)cc1
InChI Key InChIKey=LUULMBAYTFJROJ-UHFFFAOYSA-N
Data  1 IC50
  Tab Delimited (TSV)   2D SDfile   Computed 3D by Vconf -m prep SDfile
Find this compound or compounds like it in BindingDB:
Activity Spreadsheet -- Enzyme Inhibition Constant Data from BindingDB
Found 1 hit for monomerid = 50325132
TargetPhospholipid transfer protein(Homo sapiens (Human))
Beijing Institute Of Pharmacology And Toxicology
Curated by ChEMBL
LigandPNGBDBM50325132(4-chloro-N-(5-ethyl-4-(4-hydroxyphenyl)-1,3-selena...)
Affinity DataIC50:  6.00E+4nM. Assay description: Inhibition of PLTP
In DepthDetails ArticlePubMed