BDBM50325955 CHEMBL1223885::N-(3-(1-(3-(1-(4-(trifluoromethoxy)benzyl)-1H-benzo[d]imidazol-2-ylamino)propyl)piperidin-4-yl)phenyl)acetamide
SMILES CC(=O)Nc1cccc(c1)C1CCN(CCCNc2nc3ccccc3n2Cc2ccc(OC(F)(F)F)cc2)CC1
InChI Key InChIKey=BLTSSHCGYRGBOC-UHFFFAOYSA-N
Data  2 IC50
  Tab Delimited (TSV)   2D SDfile   Computed 3D by Vconf -m prep SDfile
Find this compound or compounds like it in BindingDB:
Activity Spreadsheet -- Enzyme Inhibition Constant Data from BindingDB
Found 2 hits for monomerid = 50325955
TargetMelanin-concentrating hormone receptor 1(Homo sapiens (Human))
Dr. Reddy'S Laboratories
Curated by ChEMBL
LigandPNGBDBM50325955(CHEMBL1223885 | N-(3-(1-(3-(1-(4-(trifluoromethoxy...)
Affinity DataIC50:  85nM. Assay description: Antagonist activity at human recombinant MCHR1 expressed in CHOK1 cells assessed as reduction in [3H]inositol phosphate levels by scintillation proxi...
In DepthDetails ArticlePubMed
TargetMelanin-concentrating hormone receptor 1(Homo sapiens (Human))
Dr. Reddy'S Laboratories
Curated by ChEMBL
LigandPNGBDBM50325955(CHEMBL1223885 | N-(3-(1-(3-(1-(4-(trifluoromethoxy...)
Affinity DataIC50:  35nM. Assay description: Displacement of [125I]MCH from human recombinant MCHR1 expressed in CHOK1 cells by scintillation proximity assay
In DepthDetails ArticlePubMed