BDBM50327994 1-methyl-1H-imidazole-4-sulfonic acid {2-[(4-cyanophenyl)-(3-methyl-3H-imidazol-4-ylmethyl)amino]ethyl}-(4-pyrrol-1-ylbenzyl)amide::CHEMBL214605::N-(4-(1H-pyrrol-1-yl)benzyl)-N-(2-((4-cyanophenyl)((1-methyl-1H-imidazol-5-yl)methyl)amino)ethyl)-1-methyl-1H-imidazole-4-sulfonamide
SMILES Cn1cnc(c1)S(=O)(=O)N(CCN(Cc1cncn1C)c1ccc(cc1)C#N)Cc1ccc(cc1)-n1cccc1
InChI Key InChIKey=ZLSUFGRBWKQUQB-UHFFFAOYSA-N
Data  4 IC50
  Tab Delimited (TSV)   2D SDfile   Computed 3D by Vconf -m prep SDfile
Find this compound or compounds like it in BindingDB:
Activity Spreadsheet -- Enzyme Inhibition Constant Data from BindingDB
Found 4 hits for monomerid = 50327994
LigandPNGBDBM50327994(1-methyl-1H-imidazole-4-sulfonic acid {2-[(4-cyano...)
Affinity DataIC50:  390nM. Assay description: Inhibition of human farnesyltransferase assessed as incorporation of [3H]FPP into H-Ras-CVLS
In DepthDetails ArticlePubMed
LigandPNGBDBM50327994(1-methyl-1H-imidazole-4-sulfonic acid {2-[(4-cyano...)
Affinity DataIC50: >1.00E+4nM. Assay description: Inhibition of Rap1A-mediated geranylgeranylation expressed in mouse NIH3T3 cells
In DepthDetails ArticlePubMed
LigandPNGBDBM50327994(1-methyl-1H-imidazole-4-sulfonic acid {2-[(4-cyano...)
Affinity DataIC50:  5.80E+3nM. Assay description: Inhibition of human geranylgeranyltransferase-1 assessed as incorporation of [3H]GGPP into H-Ras-CVLL
In DepthDetails ArticlePubMed
LigandPNGBDBM50327994(1-methyl-1H-imidazole-4-sulfonic acid {2-[(4-cyano...)
Affinity DataIC50:  4.00E+3nM. Assay description: Inhibition of H-Ras farnesylation expressed in mouse NIH3T3 cells
In DepthDetails ArticlePubMed