BDBM50329544 (R)-2-amino-4-(3-(but-1-ynyl)phenyl)-4-(4-(difluoromethoxy)phenyl)-1-methyl-1H-imidazol-5(4H)-one::CHEMBL1270935
SMILES CCC#Cc1cccc(c1)[C@]1(N=C(N)N(C)C1=O)c1ccc(OC(F)F)cc1
InChI Key InChIKey=AIUNZLDXXBFOSW-OAQYLSRUSA-N
Data  1 IC50  1 EC50
  Tab Delimited (TSV)   2D SDfile   Computed 3D by Vconf -m prep SDfile
Find this compound or compounds like it in BindingDB:
Activity Spreadsheet -- Enzyme Inhibition Constant Data from BindingDB
Found 2 hits for monomerid = 50329544
TargetBeta-secretase 1(Homo sapiens (Human))
Pfizer
Curated by ChEMBL
LigandPNGBDBM50329544((R)-2-amino-4-(3-(but-1-ynyl)phenyl)-4-(4-(difluor...)
Affinity DataIC50:  40nM. Assay description: Inhibition of human BACE1 by FRET assay
In DepthDetails ArticlePubMed
TargetBeta-secretase 1(Homo sapiens (Human))
Pfizer
Curated by ChEMBL
LigandPNGBDBM50329544((R)-2-amino-4-(3-(but-1-ynyl)phenyl)-4-(4-(difluor...)
Affinity DataEC50:  80nM. Assay description: Inhibition of human recombinant BACE1 expressed in CHO cells assessed as reduction in amyloid beta level by sandwich ELISA
In DepthDetails ArticlePubMed