BDBM50330824 3-(7-bromo-1H-indol-3-yl)-N,N-dimethylcyclopentanamine::CHEMBL1276252
SMILES CN(C)C1CCC(C1)c1c[nH]c2c(Br)cccc12
InChI Key InChIKey=RRSSQIMFGRNMAA-UHFFFAOYSA-N
Data  1 IC50
  Tab Delimited (TSV)   2D SDfile   Computed 3D by Vconf -m prep SDfile
Find this compound or compounds like it in BindingDB:
Activity Spreadsheet -- Enzyme Inhibition Constant Data from BindingDB
Found 1 hit for monomerid = 50330824
TargetSodium-dependent serotonin transporter(Homo sapiens (Human))
Bristol-Myers Squibb
Curated by ChEMBL
LigandPNGBDBM50330824(3-(7-bromo-1H-indol-3-yl)-N,N-dimethylcyclopentana...)
Affinity DataIC50:  1.60nM. Assay description: Binding affinity to human SERT
In DepthDetails ArticlePubMed