BDBM50332648 1-(2'-(trifluoromethoxy)-5'-(trifluoromethyl)biphenyl-3-yl)-1H-pyrazole-3,5-dicarboxamide::CHEMBL1631099
SMILES NC(=O)c1cc(C(N)=O)n(n1)-c1cccc(c1)-c1cc(ccc1OC(F)(F)F)C(F)(F)F
InChI Key InChIKey=JNPMBTFQNYBLOP-UHFFFAOYSA-N
Data  2 IC50
  Tab Delimited (TSV)   2D SDfile   Computed 3D by Vconf -m prep SDfile
Find this compound or compounds like it in BindingDB:
Activity Spreadsheet -- Enzyme Inhibition Constant Data from BindingDB
Found 2 hits for monomerid = 50332648
TargetSodium channel protein type 10 subunit alpha(Homo sapiens (Human))
Merck Research Laboratories
Curated by ChEMBL
LigandPNGBDBM50332648(1-(2'-(trifluoromethoxy)-5'-(trifluoromethyl)biphe...)
Affinity DataIC50:  1.18E+6nM. Assay description: Inhibition of human Nav1.8 by VIPR assay
In DepthDetails ArticlePubMed
TargetSodium channel protein type 9 subunit alpha(Homo sapiens (Human))
Merck Research Laboratories
Curated by ChEMBL
LigandPNGBDBM50332648(1-(2'-(trifluoromethoxy)-5'-(trifluoromethyl)biphe...)
Affinity DataIC50:  325nM. Assay description: Inhibition of human Nav1.7 by VIPR assay
In DepthDetails ArticlePubMed