BDBM50334058 (3S,4S)-5-chloro-6-(1H-indol-7-yl)-2,2,4,8-tetramethyl-1,2,3,4-tetrahydroquinolin-3-ol::CHEMBL1644765
SMILES C[C@@H]1[C@H](O)C(C)(C)Nc2c(C)cc(c(Cl)c12)-c1cccc2cc[nH]c12
InChI Key InChIKey=YFJZCMOHVUUOJJ-YUNKPMOVSA-N
Data  4 KI  1 IC50  1 EC50
  Tab Delimited (TSV)   2D SDfile   Computed 3D by Vconf -m prep SDfile
Find this compound or compounds like it in BindingDB:
Activity Spreadsheet -- Enzyme Inhibition Constant Data from BindingDB
Found 6 hits for monomerid = 50334058
TargetGlucocorticoid receptor(Homo sapiens (Human))
Ligand Pharmaceuticals
Curated by ChEMBL
LigandPNGBDBM50334058((3S,4S)-5-chloro-6-(1H-indol-7-yl)-2,2,4,8-tetrame...)
Affinity DataKi:  10nM. Assay description: Displacement of radiolabeled dexamethasone from glucocorticoid receptor expressed in baculovirus
In DepthDetails ArticlePubMed
TargetAndrogen receptor(Homo sapiens (Human))
Ligand Pharmaceuticals
Curated by ChEMBL
LigandPNGBDBM50334058((3S,4S)-5-chloro-6-(1H-indol-7-yl)-2,2,4,8-tetrame...)
Affinity DataKi:  400nM. Assay description: Binding affinity to androgen receptor
In DepthDetails ArticlePubMed
TargetProgesterone receptor(Homo sapiens (Human))
Ligand Pharmaceuticals
Curated by ChEMBL
LigandPNGBDBM50334058((3S,4S)-5-chloro-6-(1H-indol-7-yl)-2,2,4,8-tetrame...)
Affinity DataKi:  1.10E+3nM. Assay description: Binding affinity to progesterone receptor
In DepthDetails ArticlePubMed
TargetMineralocorticoid receptor(Homo sapiens (Human))
Ligand Pharmaceuticals
Curated by ChEMBL
LigandPNGBDBM50334058((3S,4S)-5-chloro-6-(1H-indol-7-yl)-2,2,4,8-tetrame...)
Affinity DataKi:  1.20E+3nM. Assay description: Binding affinity to mineralocorticoid receptor
In DepthDetails ArticlePubMed
TargetGlucocorticoid receptor(Homo sapiens (Human))
Ligand Pharmaceuticals
Curated by ChEMBL
LigandPNGBDBM50334058((3S,4S)-5-chloro-6-(1H-indol-7-yl)-2,2,4,8-tetrame...)
Affinity DataEC50:  370nM. Assay description: Agonist activity at glucocorticoid receptor in human HepG2 cells co-transfected with GRE assessed as transactivation activity by luciferase reporter ...
In DepthDetails ArticlePubMed
TargetGlucocorticoid receptor(Homo sapiens (Human))
Ligand Pharmaceuticals
Curated by ChEMBL
LigandPNGBDBM50334058((3S,4S)-5-chloro-6-(1H-indol-7-yl)-2,2,4,8-tetrame...)
Affinity DataIC50:  24nM. Assay description: Transrepression activity at glucocorticoid receptor in TNFalpha/IL1beta-stimulated human HepG2 cells assessed as inhibition of NFkappaB-dependent E-s...
In DepthDetails ArticlePubMed