BDBM50336519 3-(4-chlorophenylthio)-1-(pyridin-4-ylmethyl)pyrrolidine-2,5-dione::CHEMBL1503424
SMILES Clc1ccc(SC2CC(=O)N(Cc3ccncc3)C2=O)cc1
InChI Key InChIKey=XZPATAFFGAHXJP-UHFFFAOYSA-N
Data  1 IC50
  Tab Delimited (TSV)   2D SDfile   Computed 3D by Vconf -m prep SDfile
Find this compound or compounds like it in BindingDB:
Activity Spreadsheet -- Enzyme Inhibition Constant Data from BindingDB
Found 1 hit for monomerid = 50336519
TargetPhosphodiesterase(Trypanosoma cruzi)
University Of Georgia
Curated by ChEMBL
LigandPNGBDBM50336519(3-(4-chlorophenylthio)-1-(pyridin-4-ylmethyl)pyrro...)
Affinity DataIC50:  1.00E+4nM. Assay description: Inhibition of Trypanosoma cruzi Y PDEC after 30 mins
In DepthDetails ArticlePubMed