BDBM50336815 5-(Aminomethyl)-6-(2,2-dimethylpropyl)-4-(4-methylphenyl)-2-propylpyridine-3-carboxylic Acid Dihydrochloride::CHEMBL1672122
SMILES CCCc1nc(CC(C)(C)C)c(CN)c(-c2ccc(C)cc2)c1C(O)=O
InChI Key InChIKey=YWQHCEYTLCXOCJ-UHFFFAOYSA-N
Data  4 IC50
  Tab Delimited (TSV)   2D SDfile   Computed 3D by Vconf -m prep SDfile
Find this compound or compounds like it in BindingDB:
Activity Spreadsheet -- Enzyme Inhibition Constant Data from BindingDB
Found 4 hits for monomerid = 50336815
TargetDipeptidyl peptidase 4(Homo sapiens (Human))
Takeda Pharmaceutical
Curated by ChEMBL
LigandPNGBDBM50336815(5-(Aminomethyl)-6-(2,2-dimethylpropyl)-4-(4-methyl...)
Affinity DataIC50:  4.40nM. Assay description: Inhibition of DPP4 in human Caco2 cells after 60 mins
In DepthDetails ArticlePubMed
TargetDipeptidyl peptidase 9(Homo sapiens (Human))
Takeda Pharmaceutical
Curated by ChEMBL
LigandPNGBDBM50336815(5-(Aminomethyl)-6-(2,2-dimethylpropyl)-4-(4-methyl...)
Affinity DataIC50:  1.60E+3nM. Assay description: Inhibition of FLAG-tagged human DPP9 expressed in human 293F cells after 90 mins
In DepthDetails ArticlePubMed
TargetDipeptidyl peptidase 8(Homo sapiens (Human))
Takeda Pharmaceutical
Curated by ChEMBL
LigandPNGBDBM50336815(5-(Aminomethyl)-6-(2,2-dimethylpropyl)-4-(4-methyl...)
Affinity DataIC50:  630nM. Assay description: Inhibition of FLAG-tagged human DPP8 expressed in human 293F cells after 90 mins
In DepthDetails ArticlePubMed
TargetDipeptidyl peptidase 2(Rattus norvegicus)
Takeda Pharmaceutical
Curated by ChEMBL
LigandPNGBDBM50336815(5-(Aminomethyl)-6-(2,2-dimethylpropyl)-4-(4-methyl...)
Affinity DataIC50:  2.00E+3nM. Assay description: Inhibition of rat kidney DPP2 after 60 mins
In DepthDetails ArticlePubMed