BDBM50338307 (+/-)-(3R,4S)-6-(1H-indol-7-yl)-2,2,4,8-tetramethyl-7-vinyl-1,2,3,4-tetrahydroquinolin-3-ol::CHEMBL1682435
SMILES C[C@@H]1[C@@H](O)C(C)(C)Nc2c(C)c(C=C)c(cc12)-c1cccc2cc[nH]c12
InChI Key InChIKey=PIYPSTIVNHVVBW-RCDICMHDSA-N
Data  1 KI  2 IC50  1 EC50
  Tab Delimited (TSV)   2D SDfile   Computed 3D by Vconf -m prep SDfile
Find this compound or compounds like it in BindingDB:
Activity Spreadsheet -- Enzyme Inhibition Constant Data from BindingDB
Found 4 hits for monomerid = 50338307
TargetGlucocorticoid receptor(Homo sapiens (Human))
Ligand Pharmaceuticals
Curated by ChEMBL
LigandPNGBDBM50338307((+/-)-(3R,4S)-6-(1H-indol-7-yl)-2,2,4,8-tetramethy...)
Affinity DataKi:  3.10nM. Assay description: Displacement of radiolabeled dexamethasone from GR
In DepthDetails ArticlePubMed
TargetGlucocorticoid receptor(Homo sapiens (Human))
Ligand Pharmaceuticals
Curated by ChEMBL
LigandPNGBDBM50338307((+/-)-(3R,4S)-6-(1H-indol-7-yl)-2,2,4,8-tetramethy...)
Affinity DataEC50:  18nM. Assay description: Agonist activity at GR expressed in african green monkey CV1 cells transfected with luciferase gene linked to MMTV promoter assessed as induction of ...
In DepthDetails ArticlePubMed
TargetGlucocorticoid receptor(Homo sapiens (Human))
Ligand Pharmaceuticals
Curated by ChEMBL
LigandPNGBDBM50338307((+/-)-(3R,4S)-6-(1H-indol-7-yl)-2,2,4,8-tetramethy...)
Affinity DataIC50: >1.00E+3nM. Assay description: Agonist activity at human GR expressed in NHDF cells assessed as inhibition of IL-6 production by ELISA relative to dexamethasone
In DepthDetails ArticlePubMed
TargetGlucocorticoid receptor(Homo sapiens (Human))
Ligand Pharmaceuticals
Curated by ChEMBL
LigandPNGBDBM50338307((+/-)-(3R,4S)-6-(1H-indol-7-yl)-2,2,4,8-tetramethy...)
Affinity DataIC50:  13nM. Assay description: Agonist activity at GR expressed in IL-1beta- and TNFalpha-stimulated HepG2 cells assessed as inhibition of NFKB- or AP-1 mediated E-selectin transcr...
In DepthDetails ArticlePubMed