BDBM50345213 2-Propyl-3-methyl-N-(4-sulfamoylphenyl)pentanamide::3-methyl-2-propyl-N-(4-sulfamoylphenyl)pentanamide::CHEMBL1084702
SMILES CCCC(C(C)CC)C(=O)Nc1ccc(cc1)S(N)(=O)=O
InChI Key InChIKey=LOFVHDSPKRGLMF-UHFFFAOYSA-N
Data  4 KI
  Tab Delimited (TSV)   2D SDfile   Computed 3D by Vconf -m prep SDfile
Find this compound or compounds like it in BindingDB:
Activity Spreadsheet -- Enzyme Inhibition Constant Data from BindingDB
Found 4 hits for monomerid = 50345213
TargetCarbonic anhydrase 2(Homo sapiens (Human))
The Hebrew University Of Jerusalem
Curated by ChEMBL
LigandPNGBDBM50345213(2-Propyl-3-methyl-N-(4-sulfamoylphenyl)pentanamide...)
Affinity DataKi:  233nM. Assay description: Inhibition of human carbonic anhydrase 2 preincubated with compound for 15 mins by carbon dioxide hydration assay
In DepthDetails ArticlePubMed
TargetCarbonic anhydrase 14(Homo sapiens (Human))
The Hebrew University Of Jerusalem
Curated by ChEMBL
LigandPNGBDBM50345213(2-Propyl-3-methyl-N-(4-sulfamoylphenyl)pentanamide...)
Affinity DataKi:  610nM. Assay description: Inhibition of human carbonic anhydrase 14 preincubated with compound for 15 mins by carbon dioxide hydration assay
In DepthDetails ArticlePubMed
TargetCarbonic anhydrase 1(Homo sapiens (Human))
The Hebrew University Of Jerusalem
Curated by ChEMBL
LigandPNGBDBM50345213(2-Propyl-3-methyl-N-(4-sulfamoylphenyl)pentanamide...)
Affinity DataKi:  4.26E+3nM. Assay description: Inhibition of human carbonic anhydrase 1 preincubated with compound for 15 mins by carbon dioxide hydration assay
In DepthDetails ArticlePubMed
TargetCarbonic anhydrase 7(Homo sapiens (Human))
The Hebrew University Of Jerusalem
Curated by ChEMBL
LigandPNGBDBM50345213(2-Propyl-3-methyl-N-(4-sulfamoylphenyl)pentanamide...)
Affinity DataKi:  5.15E+3nM. Assay description: Inhibition of human carbonic anhydrase 7 preincubated with compound for 15 mins by carbon dioxide hydration assay
In DepthDetails ArticlePubMed