BDBM50347401 CHEMBL1801855
SMILES C\C=C\CN(Cc1ccc2nc(C)n(C)c(=O)c2c1)c1ccc(cc1)C(=O)NCc1cccnc1
InChI Key InChIKey=UHJUHNDNYNZSKZ-SNAWJCMRSA-N
Data  1 IC50
  Tab Delimited (TSV)   2D SDfile   Computed 3D by Vconf -m prep SDfile
Find this compound or compounds like it in BindingDB:
Activity Spreadsheet -- Enzyme Inhibition Constant Data from BindingDB
Found 1 hit for monomerid = 50347401
TargetNicotinamide phosphoribosyltransferase(Homo sapiens (Human))
Myrexis
Curated by ChEMBL
LigandPNGBDBM50347401(CHEMBL1801855)
Affinity DataIC50:  2.90nM. Assay description: Inhibition of nicotinamide phosphoribosyltransferase-catalyzed conversion of nicotinamide to nicotinamide mononucleotide
In DepthDetails ArticlePubMed