BDBM50350297 CHEMBL1812544
SMILES C(=Cc1nnn[nH]1)c1c[nH]c2ccccc12
InChI Key InChIKey=YLHZVTMUYKFTNE-UHFFFAOYSA-N
Data  1 IC50
  Tab Delimited (TSV)   2D SDfile   Computed 3D by Vconf -m prep SDfile
Find this compound or compounds like it in BindingDB:
Activity Spreadsheet -- Enzyme Inhibition Constant Data from BindingDB
Found 1 hit for monomerid = 50350297
TargetTryptophan 2,3-dioxygenase(Mus musculus)
University Of Namur
Curated by ChEMBL
LigandPNGBDBM50350297(CHEMBL1812544)
Affinity DataIC50:  1.00E+4nM. Assay description: Inhibition of mouse TDO expressed in mouse P815B cells assessed as inhibition of tryptophan catabolism by measuring kynurenine production after 8 hrs...
In DepthDetails ArticlePubMed