BDBM50355751 CHEMBL1911286
SMILES CO[C@H]1\C=C\O[C@@]2(C)Oc3c(C2=O)c2C(=O)C=C(NC(=O)\C(C)=C/C=C/[C@H](C)[C@H](O)[C@@H](C)[C@@H](O)[C@@H](C)[C@H](OC(C)=O)[C@@H]1C)C(=O)c2c(OS(=O)(=O)c1ccc(C)cc1)c3C
InChI Key InChIKey=AQTBWWXWPLHUCJ-PQBMYWSQSA-N
Data  1 IC50
  Tab Delimited (TSV)   2D SDfile   Computed 3D by Vconf -m prep SDfile
Find this compound or compounds like it in BindingDB:
Activity Spreadsheet -- Enzyme Inhibition Constant Data from BindingDB
Found 1 hit for monomerid = 50355751
TargetDNA-directed RNA polymerase subunit beta(Mycobacterium tuberculosis)
University Of Michigan
Curated by ChEMBL
LigandPNGBDBM50355751(CHEMBL1911286)
Affinity DataIC50:  21nM. Assay description: Inhibition of wild type Mycobacterium tuberculosis RNA polymerase after 10 mins using ribo green staining by rolling circle transcription assay
In DepthDetails ArticlePubMed