BDBM50356705 CHEMBL1917620
SMILES CN(c1cccc(c1)C#Cc1cc(Cl)ccc1OCC(O)=O)S(C)(=O)=O
InChI Key InChIKey=PKJHLDKGOJUKNV-UHFFFAOYSA-N
Data  1 KI
  Tab Delimited (TSV)   2D SDfile   Computed 3D by Vconf -m prep SDfile
Find this compound or compounds like it in BindingDB:
Activity Spreadsheet -- Enzyme Inhibition Constant Data from BindingDB
Found 1 hit for monomerid = 50356705
TargetProstaglandin D2 receptor 2(Homo sapiens (Human))
Merck Serono
Curated by ChEMBL
LigandPNGBDBM50356705(CHEMBL1917620)
Affinity DataKi:  122nM. Assay description: Displacement of [3H]PGD2 from human CRTH2 expressed in chinese hamster CHO cells by liquid scintillation counting
In DepthDetails ArticlePubMed