BDBM50360803 CHEMBL1934667
SMILES CN(C)Cc1ccc(CNC(=O)Nc2ccc(Cl)cc2)cc1
InChI Key InChIKey=AUPXWIPEMFTOJN-UHFFFAOYSA-N
Data  1 IC50
  Tab Delimited (TSV)   2D SDfile   Computed 3D by Vconf -m prep SDfile
Find this compound or compounds like it in BindingDB:
Activity Spreadsheet -- Enzyme Inhibition Constant Data from BindingDB
Found 1 hit for monomerid = 50360803
TargetLanosterol synthase(Homo sapiens (Human))
Institute Of Microbial Chemistry
Curated by ChEMBL
LigandPNGBDBM50360803(CHEMBL1934667)
Affinity DataIC50:  3.12E+3nM. Assay description: Inhibition of human OSC expressed in Saccharomyces cerevisiae by gas chromatography
In DepthDetails ArticlePubMed