BDBM50361540 CHEMBL1377752
SMILES Cc1ccc(NS(=O)(=O)c2ccc3n(C)c(=O)oc3c2)cc1C
InChI Key InChIKey=WOHFPYQPLYBUJX-UHFFFAOYSA-N
Data  1 EC50
  Tab Delimited (TSV)   2D SDfile   Computed 3D by Vconf -m prep SDfile
Find this compound or compounds like it in BindingDB:
Activity Spreadsheet -- Enzyme Inhibition Constant Data from BindingDB
Found 1 hit for monomerid = 50361540
TargetPyruvate kinase PKM(Homo sapiens (Human))
National Human Genome Research Institute
Curated by ChEMBL
LigandPNGBDBM50361540(CHEMBL1377752)
Affinity DataEC50:  4.30E+3nM. Assay description: Activation of human PKM2 assessed as ATP product formation after 1 hr by luminescent pyruvate kinase-luciferase coupled assay
In DepthDetails ArticlePubMed