BDBM50363889 CHEMBL1944847
SMILES CCCCCCc1ccc(NC(=O)Cn2ccc3n(C)c(=O)n(C)c(=O)c23)cc1
InChI Key InChIKey=ANSVBJGYIJAUDS-UHFFFAOYSA-N
Data  1 IC50
  Tab Delimited (TSV)   2D SDfile   Computed 3D by Vconf -m prep SDfile
Find this compound or compounds like it in BindingDB:
Activity Spreadsheet -- Enzyme Inhibition Constant Data from BindingDB
Found 1 hit for monomerid = 50363889
TargetTransient receptor potential cation channel subfamily A member 1(Homo sapiens (Human))
University Of Ferrara
Curated by ChEMBL
LigandPNGBDBM50363889(CHEMBL1944847)
Affinity DataIC50:  1.60E+3nM. Assay description: Antagonist activity at human TRPA1 expressed in human IMR90 cells assessed as inhibition of acrolein-induced calcium influx after 40 mins by fluoresc...
In DepthDetails ArticlePubMed