BDBM50365529 CHEMBL1957495
SMILES Oc1cccc(c1)-c1cn2c(cnc2c(n1)N1CCOCC1)N1CCNCC1
InChI Key InChIKey=USXOIAOCDRONET-UHFFFAOYSA-N
Data  1 IC50
  Tab Delimited (TSV)   2D SDfile   Computed 3D by Vconf -m prep SDfile
Find this compound or compounds like it in BindingDB:
Activity Spreadsheet -- Enzyme Inhibition Constant Data from BindingDB
Found 1 hit for monomerid = 50365529
TargetPhosphatidylinositol 3-kinase regulatory subunit alpha/4,5-bisphosphate 3-kinase catalytic subunit alpha isoform(Homo sapiens (Human))
Spanish National Cancer Research Centre (Cnio)
Curated by ChEMBL
LigandPNGBDBM50365529(CHEMBL1957495)
Affinity DataIC50:  897nM. Assay description: Inhibition of PI3K p110alpha/p85alpha
In DepthDetails ArticlePubMed