BDBM50372209 CHEMBL256249
SMILES CN(Cc1cc(Cl)ccc1C#N)C1CCN(C)CC1
InChI Key InChIKey=XTNITBVIVBRMHV-UHFFFAOYSA-N
Data  4 IC50
  Tab Delimited (TSV)   2D SDfile   Computed 3D by Vconf -m prep SDfile
Find this compound or compounds like it in BindingDB:
Activity Spreadsheet -- Enzyme Inhibition Constant Data from BindingDB
Found 4 hits for monomerid = 50372209
TargetNitric oxide synthase, inducible(Homo sapiens (Human))
Adolor
Curated by ChEMBL
LigandPNGBDBM50372209(CHEMBL256249)
Affinity DataIC50:  290nM. Assay description: Inhibition of human iNOS expressed in human DLD1 cells after 1 hr
In DepthDetails ArticlePubMed
TargetNitric oxide synthase, endothelial(Homo sapiens (Human))
Adolor
Curated by ChEMBL
LigandPNGBDBM50372209(CHEMBL256249)
Affinity DataIC50:  770nM. Assay description: Inhibition of human eNOS expressed in insect SF9 cells after 1 hr
In DepthDetails ArticlePubMed
TargetNitric oxide synthase, inducible(Homo sapiens (Human))
Adolor
Curated by ChEMBL
LigandPNGBDBM50372209(CHEMBL256249)
Affinity DataIC50:  3.70E+3nM. Assay description: Inhibition of cytokine-induced iNOS activity in human DLD1 cells after 24 hrs
In DepthDetails ArticlePubMed
TargetNitric oxide synthase, brain(Homo sapiens (Human))
Adolor
Curated by ChEMBL
LigandPNGBDBM50372209(CHEMBL256249)
Affinity DataIC50:  540nM. Assay description: Inhibition of human nNOS expressed in insect SF9 cells after 1 hr
In DepthDetails ArticlePubMed