BDBM50373764 CHEMBL401590
SMILES CCOC(=O)CCCN1CC[C@@]2(C)[C@@H](C)C1Cc1ccc(O)cc21
InChI Key InChIKey=DRQSQGYYPZMJLQ-GUVZCDSQSA-N
Data  1 EC50
  Tab Delimited (TSV)   2D SDfile   Computed 3D by Vconf -m prep SDfile
Find this compound or compounds like it in BindingDB:
Activity Spreadsheet -- Enzyme Inhibition Constant Data from BindingDB
Found 1 hit for monomerid = 50373764
TargetMu-type opioid receptor(MOUSE)
University Of Maryland
Curated by ChEMBL
LigandPNGBDBM50373764(CHEMBL401590)
Affinity DataEC50:  1.79E+4nM. Assay description: Agonist activity at mu opioid receptor in Swiss mouse vas deferens assessed as inhibition of electrically-stimulated twitch
In DepthDetails ArticlePubMed