BDBM50374181 CHEMBL256837
SMILES Oc1ccc(cc1Cl)C(=O)N\N=C\c1ccc(OCc2cccc(c2)C(F)(F)F)cc1
InChI Key InChIKey=CEPDAGIBNQXCJC-KKMKTNMSSA-N
Data  1 KI
  Tab Delimited (TSV)   2D SDfile   Computed 3D by Vconf -m prep SDfile
Find this compound or compounds like it in BindingDB:
Activity Spreadsheet -- Enzyme Inhibition Constant Data from BindingDB
Found 1 hit for monomerid = 50374181
TargetPituitary adenylate cyclase-activating polypeptide type I receptor(Homo sapiens (Human))
Abbott Laboratories
Curated by ChEMBL
LigandPNGBDBM50374181(CHEMBL256837)
Affinity DataKi:  537nM. Assay description: Displacement of [125I]PACAP27 from PAC1R expressed in HEK293f cells
In DepthDetails ArticlePubMed