BDBM50376070 CHEMBL264965
SMILES NC1CCN(CC1)c1ccnc2[nH]ccc12
InChI Key InChIKey=ZFBACGKIDNXYRK-UHFFFAOYSA-N
Data  1 IC50
  Tab Delimited (TSV)   2D SDfile   Computed 3D by Vconf -m prep SDfile
Find this compound or compounds like it in BindingDB:
Activity Spreadsheet -- Enzyme Inhibition Constant Data from BindingDB
Found 1 hit for monomerid = 50376070
TargetRAC-beta serine/threonine-protein kinase(Homo sapiens (Human))
The Institute Of Cancer Research
Curated by ChEMBL
LigandPNGBDBM50376070(CHEMBL264965)
Affinity DataIC50:  880nM. Assay description: Inhibition of PKBbeta recombinant by radiometric filter binding assay
In DepthDetails ArticlePubMed