BDBM50378509 CHEMBL569057
SMILES Brc1ccc-2c(c1)-c1nncn1Cc1c(I)ncn-21
InChI Key InChIKey=LTEBSFSMLJAUDM-UHFFFAOYSA-N
Data  1 KI
  Tab Delimited (TSV)   2D SDfile   Computed 3D by Vconf -m prep SDfile
Find this compound or compounds like it in BindingDB:
Activity Spreadsheet -- Enzyme Inhibition Constant Data from BindingDB
Found 1 hit for monomerid = 50378509
TargetGABA-A receptor; alpha-5/beta-3/gamma-2(Homo sapiens (Human))
F. Hoffmann-La Roche
Curated by ChEMBL
LigandPNGBDBM50378509(CHEMBL569057)
Affinity DataKi:  7.80nM. Assay description: Binding affinity to GABAA alpha-5-beta-3-gamma-2 receptor
In DepthDetails ArticlePubMed