BDBM50382459 CHEMBL2023986::US10196373, Compound 27NH
SMILES CN(CC(=O)N(Cc1ccc(cc1)-c1ccc(cc1)-c1ccc(cc1)C(N)=O)c1ccc(C(O)=O)c(O)c1)S(=O)(=O)c1ccc(C)cc1
InChI Key InChIKey=KOVXOSJQVVRPFQ-UHFFFAOYSA-N
Data  5 KI  2 IC50
  Tab Delimited (TSV)   2D SDfile   Computed 3D by Vconf -m prep SDfile
Find this compound or compounds like it in BindingDB:
Activity Spreadsheet -- Enzyme Inhibition Constant Data from BindingDB
Found 7 hits for monomerid = 50382459
TargetSignal transducer and activator of transcription 5B(Homo sapiens (Human))
University Of Toronto
Curated by ChEMBL
LigandPNGBDBM50382459(CHEMBL2023986 | US10196373, Compound 27NH)
Affinity DataKi:  4.80E+3nM. Assay description: Displacement of 5-carboxyfluorescein-labeled GpYLVLDKW from the STAT5b-SH2 domain after 15 mins by fluorescent polarization assay
In DepthDetails ArticlePubMed
TargetSignal transducer and activator of transcription 3(Homo sapiens (Human))
University Of Toronto
Curated by ChEMBL
LigandPNGBDBM50382459(CHEMBL2023986 | US10196373, Compound 27NH)
Affinity DataKi:  8.40E+3nM. Assay description: Displacement of fluorescein-labeled phosphotyrosine-peptide derived from the interleukin-6 receptor subunit gp130 from the STAT3 after 15 mins by flu...
In DepthDetails ArticlePubMed
TargetSignal transducer and activator of transcription 1-alpha/beta(Homo sapiens (Human))
University Of Toronto
Curated by ChEMBL
LigandPNGBDBM50382459(CHEMBL2023986 | US10196373, Compound 27NH)
Affinity DataKi:  9.50E+3nM. Assay description: Displacement of radioligand from the STAT1 after 15 mins by fluorescent polarization assay
In DepthDetails ArticlePubMed
TargetSignal transducer and activator of transcription 3(Homo sapiens (Human))
University Of Toronto
Curated by ChEMBL
LigandPNGBDBM50382459(CHEMBL2023986 | US10196373, Compound 27NH)
Affinity DataKi:  1.67E+4nM. Assay description: ChIP assay was performed using EZ ChIP Kit (Millipore, Billerica, Mass., USA) as per manufacturer's instruction. Briefly, after crosslinking with...
In DepthDetails US Patent
TargetSignal transducer and activator of transcription 3(Homo sapiens (Human))
University Of Toronto
Curated by ChEMBL
LigandPNGBDBM50382459(CHEMBL2023986 | US10196373, Compound 27NH)
Affinity DataKi:  1.67E+4nM. Assay description: Inhibition of STAT3 SH2 domain assessed as inhibition of STAT3 SH2-phosphotyrosine interaction after 15 mins by fluorescence polarization assay
In DepthDetails ArticlePubMed
TargetSignal transducer and activator of transcription 3(Mus musculus (mouse))
University Of Southern California
Curated by ChEMBL
LigandPNGBDBM50382459(CHEMBL2023986 | US10196373, Compound 27NH)
Affinity DataIC50:  4.30E+4nM. Assay description: Inhibition of STAT3 dimerization in v-Src transformed mouse NIH/3T3 cells overexpressing human EGFR assessed as suppression of STAT3-DNA interaction ...
In DepthDetails ArticlePubMed
TargetSignal transducer and activator of transcription 3(Homo sapiens (Human))
University Of Toronto
Curated by ChEMBL
LigandPNGBDBM50382459(CHEMBL2023986 | US10196373, Compound 27NH)
Affinity DataIC50:  4.30E+4nM. Assay description: ChIP assay was performed using EZ ChIP Kit (Millipore, Billerica, Mass., USA) as per manufacturer's instruction. Briefly, after crosslinking with...
In DepthDetails US Patent