BDBM50384499 CHEMBL2036032
SMILES CCC(=O)N(Cc1cccc(F)c1)c1cccc(c1)-c1nnn[nH]1
InChI Key InChIKey=DJKBIXWTZHBMGC-UHFFFAOYSA-N
Data  1 KI
  Tab Delimited (TSV)   2D SDfile   Computed 3D by Vconf -m prep SDfile
Find this compound or compounds like it in BindingDB:
Activity Spreadsheet -- Enzyme Inhibition Constant Data from BindingDB
Found 1 hit for monomerid = 50384499
TargetProstaglandin D2 receptor 2(Homo sapiens (Human))
TBA
Curated by ChEMBL
LigandPNGBDBM50384499(CHEMBL2036032)
Affinity DataKi:  1.40E+3nM. Assay description: Displacement of [3HPGD2 from human CRTH2 receptor expressed in CHO cell membrane after 90 mins by scintillation proximity assay
In DepthDetails ArticlePubMed