BDBM50386636 CHEMBL1234349
SMILES OC([C@H]1CCCN1S(=O)(=O)CCCn1ccc(=O)[nH]c1=O)(c1ccccc1)c1ccccc1
InChI Key InChIKey=NBGXNYZRJDHHHU-OAQYLSRUSA-N
Data  2 IC50
PDB links: 1 PDB ID matches this monomer.
  Tab Delimited (TSV)   2D SDfile   Computed 3D by Vconf -m prep SDfile
Find this compound or compounds like it in BindingDB:
Activity Spreadsheet -- Enzyme Inhibition Constant Data from BindingDB
Found 2 hits for monomerid = 50386636
TargetDeoxyuridine 5'-triphosphate nucleotidohydrolase, mitochondrial(Homo sapiens (Human))
Taiho Pharmaceutical
Curated by ChEMBL
LigandPNGBDBM50386636(CHEMBL1234349)
Affinity DataIC50:  320nM. Assay description: Inhibition of human dUTPase assessed as production of [5-3H]dUMP from [5-3H]dUTP after 15 mins measured by HPLC analysis
TargetDeoxyuridine 5'-triphosphate nucleotidohydrolase, mitochondrial(Homo sapiens (Human))
Taiho Pharmaceutical
Curated by ChEMBL
LigandPNGBDBM50386636(CHEMBL1234349)
Affinity DataIC50:  320nM. Assay description: Inhibition of human dUTPase using [5-3H]dUTP as substrate after 15 mins by HPLC analysis