BDBM50389998 CHEMBL2071276
SMILES NC(=O)[C@H]1[C@H]2C[C@H](C=C2)[C@H]1Nc1nc(Nc2cnn(c2)[C@@H]2CCCNC2)ncc1Cl
InChI Key InChIKey=NUIGAOCWJPYVEO-BEANVFONSA-N
Data  3 IC50
  Tab Delimited (TSV)   2D SDfile   Computed 3D by Vconf -m prep SDfile
Find this compound or compounds like it in BindingDB:
Activity Spreadsheet -- Enzyme Inhibition Constant Data from BindingDB
Found 3 hits for monomerid = 50389998
TargetVascular endothelial growth factor receptor 2(Homo sapiens (Human))
Abbott Laboratories
Curated by ChEMBL
LigandPNGBDBM50389998(CHEMBL2071276)
Affinity DataIC50:  44nM. Assay description: Inhibition of human KDR autophosphorylation expressed in mouse NIH/3T3 cells
In DepthDetails ArticlePubMed
TargetVascular endothelial growth factor receptor 2(Homo sapiens (Human))
Abbott Laboratories
Curated by ChEMBL
LigandPNGBDBM50389998(CHEMBL2071276)
Affinity DataIC50:  2nM. Assay description: Inhibition of KDR by HTRF analysis in presence of 1 mM ATP
In DepthDetails ArticlePubMed
TargetAurora kinase B(Homo sapiens (Human))
Abbott Laboratories
Curated by ChEMBL
LigandPNGBDBM50389998(CHEMBL2071276)
Affinity DataIC50:  12nM. Assay description: Inhibition of Aurora B kinase by HTRF analysis in presence of 1 mM ATP
In DepthDetails ArticlePubMed