BDBM50391606 CHEMBL2147919
SMILES COc1cccc2cc3C[C@@]4(O)[C@H]5Cc6ccc(O)cc6[C@@]4(CCN5C)Cc3nc12
InChI Key InChIKey=OWZSXEQLUDAVQZ-QLBJFCOMSA-N
Data  3 KI
  Tab Delimited (TSV)   2D SDfile   Computed 3D by Vconf -m prep SDfile
Find this compound or compounds like it in BindingDB:
Activity Spreadsheet -- Enzyme Inhibition Constant Data from BindingDB
Found 3 hits for monomerid = 50391606
TargetDelta-type opioid receptor(MOUSE)
Kitasato University
Curated by ChEMBL
LigandPNGBDBM50391606(CHEMBL2147919)
Affinity DataKi:  0.498nM. Assay description: Displacement of [3H]DPDPE from delta opioid receptor in mouse whole brain without cerebellum
In DepthDetails ArticlePubMed
TargetMu-type opioid receptor(MOUSE)
Kitasato University
Curated by ChEMBL
LigandPNGBDBM50391606(CHEMBL2147919)
Affinity DataKi:  39.8nM. Assay description: Displacement of [3H]DAMGO from mu opioid receptor in mouse whole brain without cerebellum
In DepthDetails ArticlePubMed
TargetKappa-type opioid receptor(Cavia porcellus (domestic guinea pig))
Kitasato University
Curated by ChEMBL
LigandPNGBDBM50391606(CHEMBL2147919)
Affinity DataKi:  1.75E+3nM. Assay description: Displacement of [3H]U-69,593 from kappa opioid receptor in guinea pig cerebellum
In DepthDetails ArticlePubMed